{"text_format":"1","workbook":"xlsx","n_sheets":13,"sheets":["формулы","ВНИМАНИЕ","Сведения по областям","Претензии","Подразделения","добровольные виды","доброволные виды жизнь","добр перестрахование","добр жизнь перес","обязательные виды","обяз перес","инвестиции","учредители"],"not_rendered":{"charts":0,"images":2,"macros":1,"external_links":0,"defined_names":24,"comments":1,"pivot_tables":0},"unopened":[],"bounds":{"document_bytes":16777216,"sheet_cells":100000,"rows_first":2000,"rows_last":500,"rows_between":2000,"halvings":0,"cell_chars":16384,"cell_head_chars":4096},"cells_cut":0,"cells_raw":0,"read":"whole","date_system":"1900"}

{"sheet":"формулы","index":0,"n_rows":131,"n_cols":15,"rows_kept":131,"cut":false,"hidden":true,"merged":[[95,0,98,0],[95,1,95,4],[95,5,95,8],[95,9,95,12],[95,13,96,14],[96,1,96,2],[96,3,96,4],[96,5,96,6],[96,7,96,8],[96,9,96,10],[96,11,96,12],[75,0,78,0],[75,1,75,4],[75,5,75,8],[75,9,75,12],[75,13,76,14],[76,1,76,2],[76,3,76,4],[76,5,76,6],[76,7,76,8],[76,9,76,10],[76,11,76,12],[66,0,68,0],[66,1,66,4],[66,5,66,8],[67,1,67,2],[67,3,67,4],[67,5,67,6],[67,7,67,8],[57,0,59,0],[49,9,49,10],[49,11,49,12],[48,0,50,0],[57,1,57,4],[57,5,57,8],[39,13,40,14],[40,1,40,2],[40,3,40,4],[40,5,40,6],[58,1,58,2],[58,3,58,4],[58,5,58,6],[58,7,58,8],[48,13,49,14],[49,1,49,2],[49,3,49,4],[49,5,49,6],[49,7,49,8],[40,7,40,8],[40,9,40,10],[40,11,40,12],[39,0,41,0],[48,1,48,4],[48,5,48,8],[48,9,48,12],[39,1,39,4],[39,5,39,8],[39,9,39,12],[115,0,118,0],[115,1,115,4],[115,5,115,8],[115,9,115,12],[115,13,116,14],[116,1,116,2],[116,3,116,4],[116,5,116,6],[116,7,116,8],[116,9,116,10],[116,11,116,12]]}
[]
["Виды классов","Виды обязательных","Виды классов жизнь"]
[1.2,"ОСГО",1.2,null,null,null,null,"2023-03-31","по итогам I квартала 2023 года"]
["1,2,7,13","ОСГОР",1.18,null,null,null,null,"2023-06-30","по итогам II квартала 2023 года"]
["1,2,8,9","ОСГОП","1, I",null,null,null,null,"2023-09-30","по итогам III квартала 2023 года"]
[1.3,"ОСГОР аннуитет","1, I, IV",null,null,null,null,"2023-12-31","по итогам IV квартала 2023 года"]
["1,3,8,9,10","ОС СМР",null,null,null,null,null,"2024-03-31","по итогам I квартала 2024 года"]
["1,3,8,9,10,13,16","ОСПОН",null,null,null,null,null,"2024-06-30","по итогам II квартала 2024 года"]
["1,3,10","ОСПОА",null,null,null,null,null,"2024-09-30","по итогам III квартала 2024 года"]
["1,8,9","ОСПОТБ",null,null,null,null,null,"2024-12-31","по итогам IV квартала 2024 года"]
["1,8,9,13","ОСП от НС",null,null,null,null,null,"2025-03-31","по итогам I квартала 2025 года"]
[10.1,"ОГСВиН",null,null,null,null,null,"2025-06-30","по итогам II квартала 2025 года"]
[1.1299999999999999,"ОСГО ОПО",null,null,null,null,null,"2025-09-30","по итогам III квартала 2025 года"]
[1.1399999999999999,"ОГС ЖЗСЭ",null,null,null,null,null,"2025-12-31","по итогам IV квартала 2025 года"]
[1.18,"ОСЖЗСССиСФ",null,null,null,null,null,"2026-03-31","по итогам I квартала 2026 года"]
{"$rows_left_out":117}
{"sheet":"ВНИМАНИЕ","index":1,"n_rows":23,"n_cols":2,"rows_kept":23,"cut":false,"hidden":false,"merged":[[1,1,17,11],[19,1,19,3],[20,1,20,3],[21,1,21,3],[22,1,22,3]]}
[]
[null,"Уважаемые коллеги!\nПри заполнении форм страховой отчетности не допускается внесение в них изменений и/или пересохранение с изменением расширения файла. Тип файла должен оставаться с поддержкой макросов.\nДопускается только вставлять дополнительные строки в соответствующих таблицах при помощи кнопки \"Добавить строку\".\nДля корректной работы с формой страховой отчетности, необходимо разрешить работу макросов.\nВ случаях не полного заполнения форм страховой отчетности и/или несоответствия данных в различных формах, соответствующая строка или столбец загораются красным цветом.\nНеобходимо заполнить количество подразделений страховой компании в областях в соответствующем листе (\"Подразделения\"), с указание их количества в каждой области (при этом центральный офис не учитывается) в таблице в верхнем правом углу, которая не попадает в область печати.\nЭлектронные формы страховой отчетности необходимо присылать на следующие эл. адреса: \nnapp@exat.uz; info@napp.uz\nПо всем вопросам обращайтесь по следующему телефонному номеру:\n(71) 231-79-18"]
[]
[]
[]
[]
[]
[]
[]
[]
[]
[]
[]
[]
[]
{"$rows_left_out":9}
{"sheet":"Сведения по областям","index":2,"n_rows":58,"n_cols":27,"rows_kept":58,"cut":false,"hidden":false,"merged":[[5,7,5,9],[30,0,33,0],[30,1,30,8],[57,0,57,1],[57,4,57,5],[56,0,56,1],[53,4,53,5],[53,0,53,1],[30,9,32,9],[52,0,52,1],[31,1,31,2],[31,3,31,4],[31,5,31,6],[9,11,9,12],[9,15,9,16],[9,7,9,8],[30,17,32,17],[29,11,29,12],[29,13,29,17],[30,13,30,16],[31,13,32,13],[31,14,32,14],[31,15,32,15],[30,11,30,12],[31,11,32,11],[31,12,32,12],[31,16,32,16],[30,10,32,10],[2,6,2,10],[0,14,0,17],[31,7,31,8],[8,0,11,0],[9,1,9,2],[7,1,7,8],[7,10,7,17],[8,1,8,8],[8,9,8,16],[29,1,29,8],[9,9,9,10],[9,13,9,14],[1,0,1,17],[9,5,9,6],[9,3,9,4],[3,6,3,10]]}
[null,null,null,null,null,null,null,null,null,null,null,null,null,null,"Приложение №1 к Правилам по заполнению форм страховой отчетности страховщиков"]
["СВЕДЕНИЯ О СТРАХОВОЙ ДЕЯТЕЛЬНОСТИ В РАЗРЕЗЕ РЕГИОНОВ РЕСПУБЛИКИ - ФОРМА №1"]
[]
[null,null,null,null,null,null,"(наименование страховщика)"]
[]
[null,null,null,null,null,null,null,{"$f":"IFERROR(VLOOKUP(#REF!,формулы!H3:K36,2,0),0)","v":0}]
[]
[null,"раздел 1",null,null,null,null,null,null,null,null,"раздел 2"]
["Наименование  регионов","Количество договоров страхования (шт.)",null,null,null,null,null,null,null,"Объем поступившей страховой премии (тыс. сум)"]
[null,"действующих на отчетную дату ",null,"в т.ч. в сельской местности",null,"заключенных за отчетный период",null,"в т.ч. в сельской местности",null,"по действовавшим в отчетном периоде договорам страхования",null,"в т.ч. в сельской местности",null,"по заключенным за отчетный период договорам страхования ",null,"в т.ч. в сельской местности"]
[null,"юр. лица","физ. лица","юр. лица","физ. лица","юр. лица","физ. лица","юр.лица","физ.лица","юр. лица","физ. лица","юр.лица","физ.лица","юр. лица","физ. лица","юр.лица","физ.лица"]
[null,1,2,3,4,5,6,7,8,9,10,11,12,13,14,15,16]
["Республика Каракалпакстан",null,null,null,null,null,null,null,null,null,null,null,null,null,null,null,null,null,null,null,null,null,null,null,null,null,{"$f":"ROUND(B27-'добровольные виды'!B38-'доброволные виды жизнь'!B33-'обязательные виды'!B23,1)","v":0}]
["Андижанская обл.",null,null,null,null,null,null,null,null,null,null,null,null,null,null,null,null,null,null,null,null,null,null,null,null,null,{"$f":"ROUND(C27-'добровольные виды'!C38-'доброволные виды жизнь'!C33-'обязательные виды'!C23,1)","v":0}]
["Бухарская обл.",null,null,null,null,null,null,null,null,null,null,null,null,null,null,null,null,null,null,null,null,null,null,null,null,null,{"$f":"ROUND(F27-'добровольные виды'!D38-'доброволные виды жизнь'!D33-'обязательные виды'!D23,1)","v":0}]
{"$rows_left_out":44}
{"sheet":"Претензии","index":3,"n_rows":39,"n_cols":27,"rows_kept":39,"cut":false,"hidden":false,"merged":[[11,5,11,6],[8,1,9,6],[37,0,37,1],[38,0,38,1],[38,4,38,5],[32,0,32,1],[33,0,33,1],[33,4,33,5],[10,7,10,10],[0,11,0,14],[1,0,1,14],[2,0,2,14],[5,0,5,14],[3,0,3,14],[8,0,13,0],[11,11,11,12],[8,13,11,14],[11,7,11,8],[11,9,11,10],[8,7,9,12],[10,11,10,12],[10,1,11,2],[10,3,10,6],[11,3,11,4]]}
[null,null,null,null,null,null,null,null,null,null,null,"Приложение №2 к Правилам по заполнению форм страховой отчетности страховщиков",null,null,null,null,null,null,null,null,null,null,null,null,null,null,{"$f":"IF(Претензии!J29='добровольные виды'!N38+'обязательные виды'!N23+'доброволные виды жизнь'!N33,1,0)","v":1}]
["СВЕДЕНИЯ О СТРАХОВЫХ ПРЕТЕНЗИЯХ В РАЗРЕЗЕ РЕГИОНОВ РЕСПУБЛИКИ - ФОРМА №2",null,null,null,null,null,null,null,null,null,null,null,null,null,null,null,null,null,null,null,null,null,null,null,null,null,{"$f":"IF(Претензии!K29='добровольные виды'!O38+'обязательные виды'!O23+'доброволные виды жизнь'!O33,1,0)","v":1}]
[{"$f":"'Сведения по областям'!G3","v":0},null,null,null,null,null,null,null,null,null,null,null,null,null,null,null,null,null,null,null,null,null,null,null,null,null,{"$f":"IF(B15=D15+F15,IF(C15=E15+G15,IF(B15=H15+L15+N15,IF(C15=I15+M15+O15,IF(D15+F15=H15+L15+N15,IF(E15+G15=I15+M15+O15,1,0),0),0),0),0),0)","v":1}]
[{"$f":"'Сведения по областям'!G4","v":"(наименование страховщика)"},null,null,null,null,null,null,null,null,null,null,null,null,null,null,null,null,null,null,null,null,null,null,null,null,null,1]
[null,null,null,null,null,null,null,null,null,null,null,null,null,null,null,null,null,null,null,null,null,null,null,null,null,null,1]
[{"$f":"'Сведения по областям'!H6","v":0},null,null,null,null,null,null,null,null,null,null,null,null,null,null,null,null,null,null,null,null,null,null,null,null,null,1]
[null,null,null,null,null,null,null,null,null,null,null,null,null,null,null,null,null,null,null,null,null,null,null,null,null,null,1]
[null,null,null,null,null,null,null,null,null,null,null,null,null,null,null,null,null,null,null,null,null,null,null,null,null,null,1]
["Наименование регионов","Количество страховых претензий (шт.) ",null,null,null,null,null,"Количество урегулированных страховых претензий ",null,null,null,null,null,"Количество не урегулированных страховых претензий (шт.)",null,null,null,null,null,null,null,null,null,null,null,null,1]
[null,null,null,null,null,null,null,null,null,null,null,null,null,null,null,null,null,null,null,null,null,null,null,null,null,null,1]
[null,"всего",null,"из них",null,null,null,"выплачено",null,null,null,"отказано",null,null,null,null,null,null,null,null,null,null,null,null,null,null,1]
[null,null,null,"поступившие в отчетном периоде",null,"перешедшие из предыдущего отчетного периода",null,"количество (шт.)",null,"сумма (тыс. сум)",null,"количество (шт.)",null,null,null,null,null,null,null,null,null,null,null,null,null,null,1]
[null,"юр. лица","физ. лица","юр. лица","физ. лица","юр. лица","физ. лица","юр. лица","физ. лица","юр. лица","физ. лица","юр. лица","физ. лица","юр. лица","физ. лица",null,null,null,null,null,null,null,null,null,null,null,1]
[null,1,2,3,4,5,6,7,8,9,10,11,12,13,14,null,null,null,null,null,null,null,null,null,null,null,1]
["Республика Каракалпакстан",{"$f":"D15+F15","v":0},{"$f":"E15+G15","v":0},null,null,null,null,null,null,null,null,null,null,null,null,null,null,null,null,null,null,null,null,null,null,null,1]
{"$rows_left_out":25}
{"sheet":"Подразделения","index":4,"n_rows":150,"n_cols":9,"rows_kept":150,"cut":false,"hidden":false,"merged":[[148,0,148,1],[149,0,149,1],[138,0,138,5],[143,0,143,1],[144,0,144,1],[23,0,23,5],[13,1,14,3],[13,0,14,0],[15,0,16,0],[15,1,16,3],[13,4,14,4],[15,4,16,4],[0,4,0,5],[2,0,2,5],[3,0,3,5],[6,0,6,5],[4,0,4,5],[5,0,5,5],[20,6,20,7],[5,6,5,8],[9,0,10,0],[9,1,10,3],[11,1,12,3],[11,0,12,0],[9,4,10,4],[11,4,12,4]]}
[null,null,null,null,"Приложение №3 к Правилам по заполнению форм страховой отчетности страховщиков"]
[]
["СВЕДЕНИЯ О ТЕРРИТОРИАЛЬНЫХ ПОДРАЗДЕЛЕНИЯХ - ФОРМА №3"]
[{"$f":"'Сведения по областям'!G3","v":0}]
[{"$f":"'Сведения по областям'!G4","v":"(наименование страховщика)"}]
[null,null,null,null,null,null,"Количество подразделений"]
[{"$f":"'Сведения по областям'!H6","v":0},null,null,null,null,null,1,"Республика Каракалпакстан"]
[null,null,null,null,null,null,2,"Андижанская область"]
[null,"Раздел 1",null,null,null,null,3,"Бухарская область"]
["1.","Количество территориальных подразделений (ед.)",null,null,null,null,4,"Джизакская область"]
[null,null,null,null,null,null,5,"Кашкадарьинская область"]
["1.1.","в т.ч. в сельской местности (ед.)",null,null,null,null,6,"Навоийская область"]
[null,null,null,null,null,null,7,"Наманганская область"]
["2.","Количество территориальных подразделений открытых в отчетном периоде (ед.)",null,null,null,null,8,"Самаркандская область"]
[null,null,null,null,null,null,9,"Сурхандарьинская область "]
{"$rows_left_out":136}
{"sheet":"добровольные виды","index":5,"n_rows":51,"n_cols":27,"rows_kept":51,"cut":false,"hidden":false,"merged":[[49,1,49,2],[50,1,50,2],[50,5,50,6],[0,11,0,14],[31,0,31,14],[11,0,11,14],[7,13,8,14],[44,1,44,2],[45,1,45,2],[45,5,45,6],[3,0,3,14],[7,0,10,0],[7,5,7,8],[8,5,8,6],[8,7,8,8],[4,0,4,14],[0,0,0,10],[7,9,7,12],[8,9,8,10],[8,11,8,12],[8,1,8,2],[8,3,8,4],[7,1,7,4],[5,0,5,14],[1,0,1,14],[2,0,2,14]]}
[null,null,null,null,null,null,null,null,null,null,null,"Приложение №4 к Правилам по заполнению форм страховой отчетности страховщиков",null,null,null,null,null,null,null,null,null,null,null,null,null,null,{"$f":"IF(Претензии!J29='добровольные виды'!N38+'обязательные виды'!N23+'доброволные виды жизнь'!N33,1,0)","v":1}]
["СВЕДЕНИЯ О ДЕЯТЕЛЬНОСТИ ПО ДОБРОВОЛЬНЫМ ВИДАМ СТРАХОВАНИЯ - ФОРМА №4",null,null,null,null,null,null,null,null,null,null,null,null,null,null,null,null,null,null,null,null,null,null,null,null,null,{"$f":"IF(Претензии!K29='добровольные виды'!O38+'обязательные виды'!O23+'доброволные виды жизнь'!O33,1,0)","v":1}]
[]
[{"$f":"'Сведения по областям'!G3","v":0}]
[{"$f":"'Сведения по областям'!G4","v":"(наименование страховщика)"}]
[{"$f":"'Сведения по областям'!H6","v":0}]
[]
["КЛАССЫ","Количество договоров страхования (шт.)",null,null,null,"Объем поступившей страховой премии (тыс. сум)",null,null,null,"Объем принятых страховых обязательств (тыс. сум)",null,null,null,"Объем страховых выплат (тыс. сум)"]
[null,"действующих на отчетную дату ",null,"заключенных за отчетный период",null,"по действовавшим в отчетном периоде договорам страхования",null,"по заключенным за отчетный период договорам страхования ",null,"по действующим на отчетную дату договорам страхования  ",null,"по заключенным за отчетный период договорам страхования "]
[null,"юр. лица","физ. лица","юр. лица","физ. лица","юр. лица","физ. лица","юр. лица","физ. лица","юр. лица","физ. лица","юр. лица","физ. лица","юр. лица","физ. лица"]
[null,1,2,3,4,5,6,7,8,9,10,11,12,13,14]
["Договора страхования, предусматривающие страхование по одному классу"]
[1]
[2]
[3]
{"$rows_left_out":37}
{"sheet":"доброволные виды жизнь","index":6,"n_rows":42,"n_cols":27,"rows_kept":42,"cut":false,"hidden":false,"merged":[[26,0,26,14],[11,0,11,14],[0,12,0,14],[41,1,41,2],[41,5,41,6],[37,1,37,2],[38,1,38,2],[38,5,38,6],[40,1,40,2],[12,0,12,14],[21,0,21,14],[7,0,10,0],[8,3,8,4],[7,5,7,8],[8,5,8,6],[8,7,8,8],[1,0,1,14],[2,0,2,14],[3,0,3,14],[7,13,8,14],[5,0,5,14],[7,9,7,12],[8,9,8,10],[8,11,8,12],[7,1,7,4],[8,1,8,2],[4,0,4,14]]}
[null,null,null,null,null,null,null,null,null,null,null,null,"Приложение №5 к Правилам по заполнению форм страховой отчетности страховщиков",null,null,null,null,null,null,null,null,null,null,null,null,null,{"$f":"IF(Претензии!J29='добровольные виды'!N38+'обязательные виды'!N23+'доброволные виды жизнь'!N33,1,0)","v":1}]
["СВЕДЕНИЯ О ДЕЯТЕЛЬНОСТИ ПО ДОБРОВОЛЬНЫМ ВИДАМ СТРАХОВАНИЯ - ФОРМА №4-1",null,null,null,null,null,null,null,null,null,null,null,null,null,null,null,null,null,null,null,null,null,null,null,null,null,{"$f":"IF(Претензии!K29='добровольные виды'!O38+'обязательные виды'!O23+'доброволные виды жизнь'!O33,1,0)","v":1}]
[]
[{"$f":"'Сведения по областям'!G3","v":0}]
[{"$f":"'Сведения по областям'!G4","v":"(наименование страховщика)"}]
[{"$f":"'Сведения по областям'!H6","v":0}]
[]
["КЛАССЫ","Количество договоров страхования (шт.)",null,null,null,"Объем поступившей страховой премии (тыс. сум)",null,null,null,"Объем принятых страховых обязательств (тыс. сум)",null,null,null,"Объем страховых выплат (тыс. сум)"]
[null,"действующих на отчетную дату ",null,"заключенных за отчетный период",null,"по действовавшим в отчетном периоде договорам страхования",null,"по заключенным за отчетный период договорам страхования ",null,"по действующим на отчетную дату договорам страхования  ",null,"по заключенным за отчетный период договорам страхования "]
[null,"юр. лица","физ. лица","юр. лица","физ. лица","юр. лица","физ. лица","юр. лица","физ. лица","юр. лица","физ. лица","юр. лица","физ. лица","юр. лица","физ. лица"]
[null,1,2,3,4,5,6,7,8,9,10,11,12,13,14]
["Договора страхования, предусматривающие страхование по одному классу"]
["Отрасль страхования жизни"]
["I"]
["II"]
{"$rows_left_out":28}
{"sheet":"добр перестрахование","index":7,"n_rows":46,"n_cols":9,"rows_kept":46,"cut":false,"hidden":false,"merged":[[45,1,45,2],[40,1,40,2],[41,1,41,2],[44,1,44,2],[8,5,8,6],[8,7,8,8],[11,0,11,8],[31,0,31,8],[0,7,0,8],[7,0,10,0],[5,0,5,8],[1,0,1,8],[2,0,2,8],[3,0,3,8],[7,1,7,4],[8,1,8,2],[8,3,8,4],[7,5,7,8],[4,0,4,8]]}
[null,null,null,null,null,null,null,"Приложение №6 к Правилам по заполнению форм страховой отчетности страховщиков"]
["СВЕДЕНИЯ О ПЕРЕСТРАХОВАНИИ ПО ДОБРОВОЛЬНЫМ ВИДАМ СТРАХОВАНИЯ - ФОРМА №5 "]
[]
[{"$f":"'Сведения по областям'!G3","v":0}]
[{"$f":"'Сведения по областям'!G4","v":"(наименование страховщика)"}]
[{"$f":"'Сведения по областям'!H6","v":0}]
[null,null,null,null,null,null,null,null,"(тыс. сум)"]
["КЛАССЫ","Объем страховой премии ",null,null,null,"Объем страховых обязательств "]
[null,"выплачено по исходящему перестрахованию",null,"получено по входящему перестрахованию",null,"передано по исходящему перестрахованию",null,"принято по входящему перестрахованию"]
[null,"страховщикам -резидентам Р.Уз.","иностранным страховым организациям","от страховщиков - резидентов Р.Уз.","от иностранных страховых организаций","страховщикам -резидентам Р.Уз.","иностранным страховым организациям","от страховщиков - резидентов Р.Уз.","от иностранных страховых организаций"]
[null,1,2,3,4,5,6,7,8]
["Договора страхования, предусматривающие страхование по одному классу"]
[1]
[2]
[3]
{"$rows_left_out":32}
{"sheet":"добр жизнь перес","index":8,"n_rows":40,"n_cols":9,"rows_kept":40,"cut":false,"hidden":false,"merged":[[39,5,39,6],[38,1,38,2],[39,1,39,2],[38,5,38,6],[21,0,21,8],[26,0,26,8],[35,1,35,2],[36,1,36,2],[36,5,36,6],[35,5,35,6],[11,0,11,8],[12,0,12,8],[0,7,0,8],[7,0,10,0],[7,1,7,4],[8,1,8,2],[8,3,8,4],[7,5,7,8],[8,5,8,6],[8,7,8,8],[5,0,5,8],[1,0,1,8],[2,0,2,8],[3,0,3,8],[4,0,4,8]]}
[null,null,null,null,null,null,null,"Приложение №7 к Правилам по заполнению форм страховой отчетности страховщиков"]
["СВЕДЕНИЯ О ПЕРЕСТРАХОВАНИИ ПО ДОБРОВОЛЬНЫМ ВИДАМ СТРАХОВАНИЯ - ФОРМА №5-1 "]
[]
[{"$f":"'Сведения по областям'!G3","v":0}]
[{"$f":"'Сведения по областям'!G4","v":"(наименование страховщика)"}]
[{"$f":"'Сведения по областям'!H6","v":0}]
[null,null,null,null,null,null,null,null,"(тыс. сум)"]
["КЛАССЫ","Объем страховой премии ",null,null,null,"Объем страховых обязательств "]
[null,"выплачено по исходящему перестрахованию",null,"получено по входящему перестрахованию",null,"передано по исходящему перестрахованию",null,"принято по входящему перестрахованию"]
[null,"страховщикам -резидентам Р.Уз.","иностранным страховым организациям","от страховщиков - резидентов Р.Уз.","от иностранных страховых организаций","страховщикам -резидентам Р.Уз.","иностранным страховым организациям","от страховщиков - резидентов Р.Уз.","от иностранных страховых организаций"]
[null,1,2,3,4,5,6,7,8]
["Договора страхования, предусматривающие страхование по одному классу"]
["Отрасль страхования жизни"]
["I"]
["II"]
{"$rows_left_out":26}
{"sheet":"обязательные виды","index":9,"n_rows":65,"n_cols":27,"rows_kept":65,"cut":false,"hidden":false,"merged":[[7,0,10,0],[7,9,7,12],[8,11,8,12],[7,13,8,14],[7,5,7,8],[8,5,8,6],[8,7,8,8],[7,1,7,4],[8,1,8,2],[8,3,8,4],[0,12,0,14],[5,0,5,14],[1,0,1,14],[2,0,2,14],[3,0,3,14],[4,0,4,14],[26,1,26,10],[29,5,29,6],[8,9,8,10],[33,5,33,6],[28,1,28,2],[32,1,32,2]]}
[null,null,null,null,null,null,null,null,null,null,null,null,"Приложение №8 к Правилам по заполнению форм страховой отчетности страховщиков",null,null,null,null,null,null,null,null,null,null,null,null,null,{"$f":"IF(Претензии!J29='добровольные виды'!N38+'обязательные виды'!N23+'доброволные виды жизнь'!N33,1,0)","v":1}]
["СВЕДЕНИЯ О ДЕЯТЕЛЬНОСТИ ПО ОБЯЗАТЕЛЬНЫМ ВИДАМ СТРАХОВАНИЯ - ФОРМА №6",null,null,null,null,null,null,null,null,null,null,null,null,null,null,null,null,null,null,null,null,null,null,null,null,null,{"$f":"IF(Претензии!K29='добровольные виды'!O38+'обязательные виды'!O23+'доброволные виды жизнь'!O33,1,0)","v":1}]
[]
[{"$f":"'Сведения по областям'!G3","v":0}]
[{"$f":"'Сведения по областям'!G4","v":"(наименование страховщика)"}]
[{"$f":"'Сведения по областям'!H6","v":0}]
[]
["Виды обязательного страхования*","Количество договоров страхования (шт.)",null,null,null,"Объем поступившей страховой премии (тыс. сум)",null,null,null,"Объем принятых страховых обязательств (тыс. сум)",null,null,null,"Объем страховых выплат (тыс. сум)"]
[null,"действующих на отчетную дату ",null,"заключенных за отчетный период",null,"по действовавшим в отчетном периоде договорам страхования",null,"по заключенным за отчетный период договорам страхования ",null,"по действующим на отчетную дату договорам страхования  ",null,"по заключенным за отчетный период договорам страхования "]
[null,"юр. лица","физ. лица","юр. лица","физ. лица","юр. лица","физ. лица","юр. лица","физ. лица","юр. лица","физ. лица","юр. лица","физ. лица","юр. лица","физ. лица"]
[null,1,2,3,4,5,6,7,8,9,10,11,12,13,14]
[]
[]
[]
[]
{"$rows_left_out":51}
{"sheet":"обяз перес","index":10,"n_rows":32,"n_cols":9,"rows_kept":32,"cut":false,"hidden":false,"merged":[[0,7,0,8],[7,0,10,0],[5,0,5,8],[1,0,1,8],[2,0,2,8],[3,0,3,8],[7,1,7,4],[8,1,8,2],[8,3,8,4],[7,5,7,8],[8,5,8,6],[8,7,8,8],[4,0,4,8]]}
[null,null,null,null,null,null,null,"Приложение №9 к Правилам по заполнению форм страховой отчетности страховщиков"]
["СВЕДЕНИЯ О ПЕРЕСТРАХОВАНИИ ПО ОБЯЗАТЕЛЬНЫМ ВИДАМ СТРАХОВАНИЯ - ФОРМА №7 "]
[]
[{"$f":"'Сведения по областям'!G3","v":0}]
[{"$f":"'Сведения по областям'!G4","v":"(наименование страховщика)"}]
[{"$f":"'Сведения по областям'!H6","v":0}]
[null,null,null,null,null,null,null,null,"(тыс. сум)"]
["Виды обязательного страхования","Объем перестраховочной премии ",null,null,null,"Объем страховых обязательств "]
[null,"выплачено по исходящему перестрахованию",null,"получено по входящему перестрахованию",null,"передано по исходящему перестрахованию",null,"принято по входящему перестрахованию"]
[null,"страховщикам -резидентам Р.Уз.","иностранным страховым организациям","от страховщиков - резидентов Р.Уз.","от иностранных страховых организаций","страховщикам -резидентам Р.Уз.","иностранным страховым организациям","от страховщиков - резидентов Р.Уз.","от иностранных страховых организаций"]
[null,1,2,3,4,5,6,7,8]
[]
[]
[]
[]
{"$rows_left_out":18}
{"sheet":"инвестиции","index":11,"n_rows":35,"n_cols":27,"rows_kept":35,"cut":false,"hidden":false,"merged":[[0,11,0,13],[7,11,7,13],[1,0,1,13],[2,0,2,13],[7,7,7,10],[3,0,3,13],[5,0,5,13],[7,3,7,6],[7,1,9,2],[4,1,4,13],[33,0,33,2],[34,0,34,2],[29,0,29,2],[28,0,28,2],[10,1,12,1],[26,0,26,13],[13,1,16,1],[17,1,20,1],[21,1,21,2],[23,1,23,2],[24,1,24,2],[22,1,22,2]]}
[null,null,null,null,null,null,null,null,null,null,null,"Приложение №10 к Правилам по заполнению форм страховой отчетности страховщиков"]
["СВЕДЕНИЯ ОБ ИНВЕСТИЦИОННОЙ ДЕЯТЕЛЬНОСТИ - ФОРМА № 8"]
[]
[{"$f":"'Сведения по областям'!G3","v":0}]
[null,{"$f":"'Сведения по областям'!G4","v":"(наименование страховщика)"}]
[{"$f":"'Сведения по областям'!H6","v":0}]
[]
[null,"Объекты инвестиционных вложений",null,"ВСЕГО",null,null,null,"В пределах Республике Узбекистан",null,null,null,"За пределами Республики Узбекистан"]
[null,null,null,"в тыс. сум","в тыс. долл. США","в тыс. Евро","в тыс.росс.руб","в тыс. сум","в тыс. долл. США","в тыс. Евро","в тыс.росс.руб","в тыс. долл. США","в тыс. Евро","в тыс.росс.руб"]
[null,null,null,1,2,3,4,5,6,7,8,9,10,11]
[null,"Депозиты (вклады)","ВСЕГО",{"$f":"SUM(D12:D13)","v":0},{"$f":"SUM(E12:E13)","v":0},0,0,0,0,0,0,0,0,0]
[null,null,"в коммерческих банках",{"$f":"H12","v":0},{"$f":"I12+L12","v":0},0,0]
[null,null,"в иных кредитных организациях",{"$f":"H13","v":0},0,0,0]
[null,"Ценные бумаги","ВСЕГО",{"$f":"SUM(D15:D17)","v":0},{"$f":"SUM(E15:E17)","v":0},0,0,0,0,0,0,0,0,0]
[null,null,"ГКО",{"$f":"H15","v":0},{"$f":"I15+L15","v":0},0,0,0]
{"$rows_left_out":21}
{"sheet":"учредители","index":12,"n_rows":45,"n_cols":8,"rows_kept":45,"cut":false,"hidden":false,"merged":[[32,1,32,2],[31,1,31,2],[23,1,23,2],[24,1,24,2],[25,1,25,2],[26,1,26,2],[27,1,27,2],[43,1,43,2],[44,1,44,2],[15,7,16,7],[15,3,16,3],[39,1,39,2],[38,1,38,2],[33,1,33,2],[17,1,17,2],[18,1,18,2],[20,1,20,2],[29,1,29,2],[30,1,30,2],[19,1,19,2],[21,1,21,2],[22,1,22,2],[28,1,28,2],[2,0,2,7],[5,0,5,7],[4,0,4,7],[6,0,6,7],[0,5,0,7],[15,0,16,0],[15,1,16,2],[3,0,3,6],[9,0,9,1],[10,0,10,1],[11,0,11,1],[12,0,12,1],[15,4,15,6]]}
[null,null,null,null,null,"Приложение №11 к Правилам по заполнению форм страховой отчетности страховщиков"]
[]
["СВЕДЕНИЯ ОБ УЧРЕДИТЕЛЯХ (АКЦИОНЕРАХ) И РАЗМЕРЕ УСТАВНОГО КАПИТАЛА - ФОРМА № 9"]
[]
[{"$f":"'Сведения по областям'!G3","v":0}]
[{"$f":"'Сведения по областям'!G4","v":"(наименование страховщика)"}]
[{"$f":"'Сведения по областям'!H6","v":0}]
[]
[null,"Раздел 1"]
["Уставный капитал",null,"тыс. сум","тыс. долл. США","тыс. евро","другие валюты","всего эквивалент в тыс. долл. США","всего эквивалент в тыс. евро"]
[1,null,2,3,4,5,6,7]
["Объявленный"]
["Сформированный (оплаченный)"]
[]
[null,"Раздел 2"]
{"$rows_left_out":30}